2-Tridecen-1-ol, (E)-

Normal alkane RI, non-polar column, custom temperature program

View large format table.

Column type Active phase I Reference Comment
CapillaryDB-51570.Judzentiene and Budiene, 200850. m/0.32 mm/0.25 μm, Helium; Program: 60 0C (2 min) 5 0C/min -> 160 0C (1 min) 10 0C/min -> 250 0C (3 min)

References

Judzentiene and Budiene, 2008
Judzentiene, A.; Budiene, J., Volatile constituents from aerial parts and roots of Cichorium intybis L. (chicory) grown in Lithuania, Chemija, 2008, 19, 2, 25-28. [all data]