3-Cyclohexenyl radical

Gas phase ion energetics data

Data compiled as indicated in comments:
RDSH - Henry M. Rosenstock, Keith Draxl, Bruce W. Steiner, and John T. Herron
B - John E. Bartmess

Electron affinity determinations

EA (eV) Method Reference Comment
0.47 ± 0.23D-EALee and Squires, 1986Between H2O, MeOH; B

Ionization energy determinations

IE (eV) Method Reference Comment
7.54EIPignataro, Cassuto, et al., 1967RDSH

References

Lee and Squires, 1986
Lee, R.E.; Squires, R.R., Anionic homoaromaticity: A gas phase experimental study, J. Am. Chem. Soc., 1986, 105, 5078. [all data]

Pignataro, Cassuto, et al., 1967
Pignataro, S.; Cassuto, A.; Lossing, F.P., Free radicals by mass spectrometry. XXXVI. Ionization potentials of conjugated and nonconjugated radicals, J. Am. Chem. Soc., 1967, 89, 3693. [all data]