Iron, bis(η5-2,4-dimethylpenta-2,4-dien-1-yl)-

Gas phase ion energetics data

Data compiled by: Sharon G. Lias, John E. Bartmess, Joel F. Liebman, John L. Holmes, Rhoda D. Levin, and W. Gary Mallard

Ionization energy determinations

IE (eV) Method Reference Comment
6.4PEStahl, Ma, et al., 1987
6.4PEBohm, Eckert-Maksic, et al., 1982
6.63PEStahl, Ma, et al., 1987Vertical value
6.6PEBohm, Eckert-Maksic, et al., 1982Vertical value

References

Stahl, Ma, et al., 1987
Stahl, L.; Ma, H.; Ernst, R.D., Synthetic, structural and pe spectroscopic studies on bis(pentadienyl) compounds of iron, ruthenium and osmium. The role of the heavy metal, J. Organomet. Chem., 1987, 326, 257. [all data]

Bohm, Eckert-Maksic, et al., 1982
Bohm, M.C.; Eckert-Maksic, M.; Ernst, R.D.; Wilson, D.R.; Gleiter, R., Electronic structure of bis(pentadienyl)iron. Semiempirical calculations and photoelectron spectra, J. Am. Chem. Soc., 1982, 104, 2699. [all data]