Malononitrile, methyl 4-methoxyphenyldiazenyl-

Gas phase ion energetics data

Data compiled by: Sharon G. Lias, Rhoda D. Levin, and Sherif A. Kafafi

Appearance energy determinations

Ion AE (eV) Other Products MethodReferenceComment
C7H7N2O+9.58C4H3N2EINuyken and Messmer, 1977
C7H7O+11.2C4H3N4EINuyken and Messmer, 1977

References

Nuyken and Messmer, 1977
Nuyken, O.; Messmer, K., Massenspektrometrische untersuchungen an azoverbindungen. II- Ermittlung thermodynamischer grossen, Org. Mass Spectrom., 1977, 12, 106. [all data]