Germacrene-4-ol

Normal alkane RI, polar column, custom temperature program

Data compiled by: NIST Mass Spectrometry Data Center, William E. Wallace, director

Column type CapillaryCapillary
Active phase HP-Innowax FSCHP-Innowax
Column length (m) 60.60.
Carrier gas HeHe
Substrate
Column diameter (mm) 0.250.25
Phase thickness (μm) 0.250.25
Program 60C (10min) => 4C/min => 220C (10min) => 1C/min => 240C60 0C (10 min) 4 K/min -> 220 0C (10 min) 1 K/min -> 240 0C
I 2069.2069.
ReferenceDemirci, Baser, et al., 2003Baser, Demirci, et al., 2002
Comment MSDC-RI MSDC-RI

Normal alkane RI, non-polar column, temperature ramp

Data compiled by: NIST Mass Spectrometry Data Center, William E. Wallace, director

Column type CapillaryCapillary
Active phase DB-1OV-101
Column length (m) 30.50.
Carrier gas N2He
Substrate
Column diameter (mm) 0.250.2
Phase thickness (μm) 0.25
Tstart (C) 80.50.
Tend (C) 250.250.
Heat rate (K/min) 4.2.
Initial hold (min)
Final hold (min)
I 1530.1559.
ReferenceMahalwal and Ali, 2003Orav and Kann, 2001
Comment MSDC-RI MSDC-RI

Van Den Dool and Kratz RI, non-polar column, temperature ramp

Data compiled by: NIST Mass Spectrometry Data Center, William E. Wallace, director

Column type CapillaryCapillary
Active phase BP-1DB-5
Column length (m) 50.30.
Carrier gas HeH2
Substrate
Column diameter (mm) 0.220.25
Phase thickness (μm) 0.250.25
Tstart (C) 60.60.
Tend (C) 220.240.
Heat rate (K/min) 2.3.
Initial hold (min)
Final hold (min) 20.
I 1571.1576.
ReferenceBoti, Koukoua, et al., 2007Nogueira, Marsaioli, et al., 1998
Comment MSDC-RI MSDC-RI

References

Demirci, Baser, et al., 2003
Demirci, B.; Baser, K.H.C.; Yildiz, B.; Bahcecioglu, Z., Composition of the essential oils of six endemic Salvia spp. from Turkey, Flavour Fragr. J., 2003, 18, 2, 116-121, https://doi.org/10.1002/ffj.1173 . [all data]

Baser, Demirci, et al., 2002
Baser, K.H.C.; Demirci, B.; Kirimer, N.; Satil, F.; Tumen, G., The essential oils of Thymus migricus and T. fedtschenkoi var. handelii from Turkey, Flavour Fragr. J., 2002, 17, 1, 41-45, https://doi.org/10.1002/ffj.1036 . [all data]