Arginine

Phase change data

Data compiled by: Thermodynamics Research Center, NIST Boulder Laboratories, Chris Muzny director

Quantity Value Units Method Reference Comment
Tfus533.KN/AKofler and Sitte, 1950Uncertainty assigned by TRC = 3. K; with "hot stage"
Tfus498.KN/AKofler and Sitte, 1950Uncertainty assigned by TRC = 15. K; under a microscope

In addition to the Thermodynamics Research Center (TRC) data available from this site, much more physical and chemical property data is available from the following TRC products:

Reaction thermochemistry data

Data compiled as indicated in comments:
B - John E. Bartmess
RCD - Robert C. Dunbar

Individual Reactions

C6H13N4O2- + Hydrogen cation = Arginine

By formula: C6H13N4O2- + H+ = C6H14N4O2

Quantity Value Units Method Reference Comment
Δr1381. ± 9.2kJ/molCIDCJones, Bernier, et al., 2007gas phase; B
Δr1388. ± 13.kJ/molG+TSO'Hair, Bowie, et al., 1992gas phase; B
Quantity Value Units Method Reference Comment
Δr1352. ± 9.6kJ/molH-TSJones, Bernier, et al., 2007gas phase; B
Δr1359. ± 13.kJ/molCIDCO'Hair, Bowie, et al., 1992gas phase; B

Sodium ion (1+) + Arginine = (Sodium ion (1+) • Arginine)

By formula: Na+ + C6H14N4O2 = (Na+ • C6H14N4O2)

Quantity Value Units Method Reference Comment
Δr>225.kJ/molCIDCKish, Ohanessian, et al., 2003Anchor alanine=39.89; RCD

Gas phase ion energetics data

Data evaluated as indicated in comments:
HL - Edward P. Hunter and Sharon G. Lias

Data compiled as indicated in comments:
B - John E. Bartmess
MM - Michael M. Meot-Ner (Mautner)

Quantity Value Units Method Reference Comment
Proton affinity (review)1051.0kJ/molN/AHunter and Lias, 1998HL
Quantity Value Units Method Reference Comment
Gas basicity1006.6kJ/molN/AHunter and Lias, 1998HL

Proton affinity at 298K

Proton affinity (kJ/mol) Reference Comment
>988.7Bojesen and Breindahl, 1994PA increased by 3.5 kcal/mol for referencing values to Hunter and Lias, 1998; MM

De-protonation reactions

C6H13N4O2- + Hydrogen cation = Arginine

By formula: C6H13N4O2- + H+ = C6H14N4O2

Quantity Value Units Method Reference Comment
Δr1381. ± 9.2kJ/molCIDCJones, Bernier, et al., 2007gas phase; B
Δr1388. ± 13.kJ/molG+TSO'Hair, Bowie, et al., 1992gas phase; B
Quantity Value Units Method Reference Comment
Δr1352. ± 9.6kJ/molH-TSJones, Bernier, et al., 2007gas phase; B
Δr1359. ± 13.kJ/molCIDCO'Hair, Bowie, et al., 1992gas phase; B

Ion clustering data

Data compiled by: Robert C. Dunbar

Clustering reactions

Sodium ion (1+) + Arginine = (Sodium ion (1+) • Arginine)

By formula: Na+ + C6H14N4O2 = (Na+ • C6H14N4O2)

Quantity Value Units Method Reference Comment
Δr>225.kJ/molCIDCKish, Ohanessian, et al., 2003Anchor alanine=39.89

References

Kofler and Sitte, 1950
Kofler, L.; Sitte, H., Melting Point Determination of Substances with Melt with Decomposition, Monatsh. Chem., 1950, 81, 619. [all data]

Jones, Bernier, et al., 2007
Jones, C.M.; Bernier, M.; Carson, E.; Colyer, K.E.; Metz, R.; Pawlow, A.; Wischow, E.D.; Webb, I.; Andriole, E.J.; Poutsma, J.C., Gas-phase Acities of the 20 Protein Amino Acids, Int. J. Mass Spectrom., 2007, 267, 1-3, 54-62, https://doi.org/10.1016/j.ijms.2007.02.018 . [all data]

O'Hair, Bowie, et al., 1992
O'Hair, R.J.; Bowie, J.H.; Gronert, S., Gas Phase Acidity of the alpha-Amino Acids, Int. J. Mass Spectrom. Ion Proc., 1992, 117, 23, https://doi.org/10.1016/0168-1176(92)80083-D . [all data]

Kish, Ohanessian, et al., 2003
Kish, M.M.; Ohanessian, G.; Wesdemiotis, C., The Na+ affinities of a-amino acids: side-chain substituent effects, Int. J. Mass Spectrom., 2003, 227, 3, 509, https://doi.org/10.1016/S1387-3806(03)00082-4 . [all data]

Hunter and Lias, 1998
Hunter, E.P.; Lias, S.G., Evaluated Gas Phase Basicities and Proton Affinities of Molecules: An Update, J. Phys. Chem. Ref. Data, 1998, 27, 3, 413-656, https://doi.org/10.1063/1.556018 . [all data]

Bojesen and Breindahl, 1994
Bojesen, G.; Breindahl, T., On the Proton Affinity od Some Alpha-Amino Acids and the Theory of the Kinetic Method., J. Chem. Soc. Perkin 2, 1994, 1029. [all data]