1H-Tetrazole, 1,5-diphenyl-

Gas phase thermochemistry data

Data compiled as indicated in comments:
ALS - Hussein Y. Afeefy, Joel F. Liebman, and Stephen E. Stein
DRB - Donald R. Burgess, Jr.

Quantity Value Units Method Reference Comment
Δfgas527. ± 4.kJ/molCcbBalepin, Lebedev, et al., 1977ALS
Δfgas535.6kJ/molN/AMcEwan and Rigg, 1951Value computed using ΔfHsolid° value of 415.6 kj/mol from McEwan and Rigg, 1951 and ΔsubH° value of 120.0 kj/mol from Balepin, Lebedev, et al., 1977.; DRB

Condensed phase thermochemistry data

Data compiled by: Hussein Y. Afeefy, Joel F. Liebman, and Stephen E. Stein

Quantity Value Units Method Reference Comment
Δfsolid407. ± 2.kJ/molCcbBalepin, Lebedev, et al., 1977
Δfsolid415.6kJ/molCcbMcEwan and Rigg, 1951
Quantity Value Units Method Reference Comment
Δcsolid-6952. ± 2.kJ/molCcbBalepin, Lebedev, et al., 1977
Δcsolid-6960.4 ± 2.2kJ/molCcbMcEwan and Rigg, 1951

Phase change data

Data compiled as indicated in comments:
ALS - Hussein Y. Afeefy, Joel F. Liebman, and Stephen E. Stein
DRB - Donald R. Burgess, Jr.
AC - William E. Acree, Jr., James S. Chickos

Quantity Value Units Method Reference Comment
Δsub120. ± 2.kJ/molVBalepin, Lebedev, et al., 1977ALS
Δsub120.0kJ/molN/ABalepin, Lebedev, et al., 1977DRB

Enthalpy of sublimation

ΔsubH (kJ/mol) Temperature (K) Method Reference Comment
121.5348.VMcEwan and Rigg, 1951ALS
121.5 ± 4.2355.MEMcEwan and Rigg, 1951Based on data from 348. - 363. K. See also Cox and Pilcher, 1970.; AC

References

Balepin, Lebedev, et al., 1977
Balepin, A.A.; Lebedev, V.P.; Miroshnichenko, E.A.; Koldobskii, G.I.; Ostovskii, V.A.; Larionov, B.P.; Gidaspov, B.V.; Lebedev, Yu.A., Energy effects in polyphenylenes and phenyltetrazoles, Svoistva Veshchestv Str. Mol., 1977, 93-98. [all data]

McEwan and Rigg, 1951
McEwan, W.S.; Rigg, M.W., The heats of combustion of compounds containing the tetrazole ring, J. Am. Chem. Soc., 1951, 73, 4725-4727. [all data]

Cox and Pilcher, 1970
Cox, J.D.; Pilcher, G., Thermochemistry of Organic and Organometallic Compounds, Academic Press Inc., London, 1970, 643. [all data]