Anthracene TCNB

Phase change data

Data compiled by: Eugene S. Domalski and Elizabeth D. Hearing

Temperature of phase transition

Ttrs (K) Initial Phase Final Phase Reference Comment
208.5crystaline, IIIcrystaline, IIEcolivet, Bertault, et al., 1987

Enthalpy of phase transition

ΔHtrs (kJ/mol) Temperature (K) Initial Phase Final Phase Reference Comment
0.151211.5crystaline, IIcrystaline, IEcolivet, Bertault, et al., 1987Total enthalpy and entropy between 180 and 215 K.

Entropy of phase transition

ΔStrs (J/mol*K) Temperature (K) Initial Phase Final Phase Reference Comment
0.71211.5crystaline, IIcrystaline, IEcolivet, Bertault, et al., 1987Total

References

Ecolivet, Bertault, et al., 1987
Ecolivet, C.; Bertault, M.; Mierzejewski, A.; Collet, A., Brillouin scattering and calorimetric studies of structural phase transitions in anthracene-TCNB and p-dichlorobenzophenone, Stud. Phys. Theor. Chem., 1987, 46, 187-192. [all data]