Propenaldimine-1-yl

Gas phase ion energetics data

Data compiled as indicated in comments:
LL - Sharon G. Lias and Joel F. Liebman

Ionization energy determinations

IE (eV) Method Reference Comment
7.37DERLias, Bartmess, et al., 1988LL

References

Lias, Bartmess, et al., 1988
Lias, S.G.; Bartmess, J.E.; Liebman, J.F.; Holmes, J.L.; Levin, R.D.; Mallard, W.G., Gas-phase ion and neutral thermochemistry, J. Phys. Chem. Ref. Data, Suppl. 1, 1988, 17, 1-861. [all data]