2,6-diMe-4-NO2-nitrobenzene radical

Gas phase ion energetics data

Data compiled by: John E. Bartmess

Electron affinity determinations

EA (eV) Method Reference Comment
1.66 ± 0.10IMREMishima, Kang, et al., 1993ΔGea(343 K) = -37.6 kcal/mol; ΔSea (est) = -2.0 eu.
1.639 ± 0.087IMREHuh, Kang, et al., 1999ΔG(EA) 343K; anchored to ΔG value. Including anchor ΔS, EA is ca. 0.4 kcal/mol more bound.

References

Mishima, Kang, et al., 1993
Mishima, M.; Kang, C.H.; Huh, C.; Fujio, M.; Tsuno, Y., Substituent Effect on Electron Affinity of 2,6-Dimethylnitrobenzene, Chem. Lett., 1993, 22, 5, 889, https://doi.org/10.1246/cl.1993.889 . [all data]

Huh, Kang, et al., 1999
Huh, C.; Kang, C.H.; Lee, H.W.; Nakamura, H.; Mishima, M.; Tsuno, Y.; Yamataka, H., Thermodynamic stabilities and resonance demand of aromatic radical anions in the gas phase, Bull. Chem. Soc. Japan, 1999, 72, 5, 1083-1091, https://doi.org/10.1246/bcsj.72.1083 . [all data]