4,5-Isoxazoledicarboxylic acid, 4,5-dihydro-3-phenyl-, dimethyl ester, trans-

Condensed phase thermochemistry data

Data compiled by: Hussein Y. Afeefy, Joel F. Liebman, and Stephen E. Stein

Quantity Value Units Method Reference Comment
Δfsolid-739.3kJ/molCcbD'Alcontres, 1953crystal phase
Quantity Value Units Method Reference Comment
Δcsolid-6234.kJ/molCcbD'Alcontres, 1953crystal phase

References

D'Alcontres, 1953
D'Alcontres, G.S., Acerca de los esteres dimetilicos de los acidos 3-fenilΔ-2 isossalina 4-5 dicarbonico. Medidas quimico-fisicas y observaciones morfologicas, Acta Cient. Venez., 1953, 4, 63-65. [all data]