CAS Reg. No. 74595-99-6

Reaction thermochemistry data

Data compiled by: John E. Bartmess

Individual Reactions

(CAS Reg. No. 74595-99-6 • 4294967295Cyanomethylene) + Cyanomethylene = CAS Reg. No. 74595-99-6

By formula: (CAS Reg. No. 74595-99-6 • 4294967295C2HN) + C2HN = CAS Reg. No. 74595-99-6

Quantity Value Units Method Reference Comment
Δr183. ± 28.kJ/molN/APoutsma, Upshaw, et al., 2002gas phase
Δr183. ± 10.kJ/molCIDTPoutsma, Upshaw, et al., 2002gas phase

References

Poutsma, Upshaw, et al., 2002
Poutsma, J.C.; Upshaw, S.D.; Squires, R.R.; Wenthold, P.G., Absolute heat of formation and singlet-triplet splitting for HCCN, J. Phys. Chem. A, 2002, 106, 6, 1067-1073, https://doi.org/10.1021/jp013653q . [all data]