PhN radical anion

Gas phase thermochemistry data

Data compiled by: John E. Bartmess

Quantity Value Units Method Reference Comment
Δfgas271. ± 15.kJ/molAcidMcDonald, Chowdhury, et al., 1981Acidity near MeCN; value altered from reference due to change in acidity scale

Vibrational and/or electronic energy levels

Data compiled by: Marilyn E. Jacox

State:   ?

 Energy
 (cm-1
 Med.   Transition   λmin
 (nm)
 λmax
 (nm)

References

McDonald, Chowdhury, et al., 1981
McDonald, R.N.; Chowdhury, A.K.; Setser, D.W., Gas phase generation of phenylnitrene anion radical: Proton affinity and heat of formation of PhN-. and its clustering with ROH molecules, J. Am. Chem. Soc., 1981, 103, 6599. [all data]