Monomethyl carbonate

Gas phase thermochemistry data

Data compiled by: Hussein Y. Afeefy, Joel F. Liebman, and Stephen E. Stein

Quantity Value Units Method Reference Comment
Δfgas-607. ± 3.kJ/molEqkHemmaplardh and King, 1972

Condensed phase thermochemistry data

Data compiled by: Hussein Y. Afeefy, Joel F. Liebman, and Stephen E. Stein

Quantity Value Units Method Reference Comment
Δfsolid-650.6 ± 5.0kJ/molKinBehrendt and Gattow, 1973

Phase change data

Data compiled by: William E. Acree, Jr., James S. Chickos

Enthalpy of sublimation

ΔsubH (kJ/mol) Temperature (K) Reference Comment
18.2 ± 1.6220.Behrendt and Gattow, 1973Based on data from 204. - 237. K.

Reaction thermochemistry data

Data compiled by: Hussein Y. Afeefy, Joel F. Liebman, and Stephen E. Stein

Individual Reactions

Monomethyl carbonate = Carbon dioxide + Methyl Alcohol

By formula: C2H4O3 = CO2 + CH4O

Quantity Value Units Method Reference Comment
Δr18. ± 2.kJ/molKinBehrendt and Gattow, 1973solid phase
Δr13. ± 4.kJ/molEqkHemmaplardh and King, 1972gas phase

References

Hemmaplardh and King, 1972
Hemmaplardh, B.; King, A.D., Jr., Solubility of methanol in compressed nitrogen, argon, methane, ethylene, ethane, carbon dioxide, and nitrous oxide. Evidence for association of carbon dioxide with methanol in the gas phase, J. Phys. Chem., 1972, 76, 2170-2175. [all data]

Behrendt and Gattow, 1973
Behrendt, W.; Gattow, G., Uber Chalkogenolates. LXII. Untersuchungen uber Halbester der Kohlensaure 2. Darstellung und Eigenschaften der Monomethylkohlensaure, Z. Anorg. Allg. Chem., 1973, 398, 198-206. [all data]