Nickelocene,decamethyl-

Gas phase ion energetics data

Data compiled by: Sharon G. Lias, Rhoda D. Levin, and Sherif A. Kafafi

Ionization energy determinations

IE (eV) Method Reference Comment
5.82PECauletti, Green, et al., 1980Vertical value

References

Cauletti, Green, et al., 1980
Cauletti, C.; Green, J.C.; Kelly, M.R.; Powell, P.; Van Tilborg, J., Photoelectron spectra of metallocenes, J. Electron Spectrosc. Relat. Phenom., 1980, 19, 327. [all data]