1-Phosphaethylene, 1-chloro-2-phenyl-2-(trimethylsilyl)-

Gas phase ion energetics data

Data compiled by: Sharon G. Lias, John E. Bartmess, Joel F. Liebman, John L. Holmes, Rhoda D. Levin, and W. Gary Mallard

Ionization energy determinations

IE (eV) Method Reference
8.3PESolouki, Bock, et al., 1982

References

Solouki, Bock, et al., 1982
Solouki, B.; Bock, H.; Appel, R.; Westerhaus, A.; Becker, G.; Uhl, G., Photoelektronen-spektren von methylidinphosphanen R-CP, Chem. Ber., 1982, 115, 3747. [all data]