1,1'-Biphenyl, 2,3,3',4,5,5',6-heptachloro-

Normal alkane RI, non-polar column, isothermal

Data compiled by: NIST Mass Spectrometry Data Center, William E. Wallace, director

Column type Capillary
Active phase Apiezon L
Column length (m) 40.
Carrier gas H2
Substrate
Column diameter (mm) 0.30
Phase thickness (μm)
Temperature (C) 180.
I 2523.
ReferenceBallschmiter and Zell, 1980
Comment MSDC-RI

References

Ballschmiter and Zell, 1980
Ballschmiter, K.; Zell, M., Analysis of polychlorinated biphenyls (PCB) by glass capillary gas chromatography, Fresenius Z. Anal. Chem., 1980, 302, 1, 20-31, https://doi.org/10.1007/BF00469758 . [all data]