AuF6 radical

Gas phase ion energetics data

Data compiled by: John E. Bartmess

Electron affinity determinations

EA (eV) Method Reference Comment
>9.999985NBIECompton and Reinhardt, 1980

References

Compton and Reinhardt, 1980
Compton, R.W.; Reinhardt, P.W., Reactions of fast cesium atoms with polymers of antimony pentafluoride and gold pentafluoride, J. Chem. Phys., 1980, 72, 4655. [all data]