Diphenyl isophthalate

Condensed phase thermochemistry data

Data compiled by: Hussein Y. Afeefy, Joel F. Liebman, and Stephen E. Stein

Quantity Value Units Method Reference Comment
Δfsolid-113.8kcal/molCcbKaryakin, Rabinovich, et al., 1975

References

Karyakin, Rabinovich, et al., 1975
Karyakin, N.V.; Rabinovich, I.B.; Kamelova, G.P.; Mochalov, A.N.; Tseitlin, G.M.; Kulagin, V.N.; Korshak, V.V., Thermodynamics of the synthesis of poly-2,2'-(m-phenylene)-5-5'-dibenzoxazolomethane, Polym. Sci. USSR, 1975, 17, 1127-1133. [all data]