Propane-1,1,1,3,3,3-d6, 2-methyl-

Gas phase ion energetics data

Data compiled by: Sharon G. Lias, Rhoda D. Levin, and Sherif A. Kafafi

Appearance energy determinations

Ion AE (eV) Other Products MethodReferenceComment
C3HD5+10.89 ± 0.02CH3DPIMead, Donchi, et al., 1980
C3HD6+11.16 ± 0.02CH3PIMead, Donchi, et al., 1980
C3H3D3+10.97 ± 0.02CD3HPIMead, Donchi, et al., 1980
C3H4D2+10.97 ± 0.02CD4PIMead, Donchi, et al., 1980
C3H4D3+11.16 ± 0.02CD3PIMead, Donchi, et al., 1980

References

Mead, Donchi, et al., 1980
Mead, P.T.; Donchi, K.F.; Traeger, J.C.; Christie, J.R.; Derrick, P.J., Secondary hydrogen isotope effect in the unimolecular decomposition of 2-methylpropane radical cations, J. Am. Chem. Soc., 1980, 102, 3364. [all data]