(-)-trans-Isopiperitenol

Normal alkane RI, polar column, temperature ramp

Data compiled by: NIST Mass Spectrometry Data Center, William E. Wallace, director

Column type CapillaryCapillaryCapillary
Active phase BP-20DB-WaxDB-Wax
Column length (m) 50.60.60.
Carrier gas HeHeH2
Substrate
Column diameter (mm) 0.220.250.32
Phase thickness (μm) 0.250.250.25
Tstart (C) 60.40.60.
Tend (C) 220.200.220.
Heat rate (K/min) 2.2.3.
Initial hold (min)  2.
Final hold (min) 20.
I 1744.1745.1750.
ReferenceBoti, Muselli, et al., 2006Umano, Hagi, et al., 2002Werkhoff, Güntert, et al., 1998
Comment MSDC-RI MSDC-RI MSDC-RI

References

Boti, Muselli, et al., 2006
Boti, J.B.; Muselli, A.; Tomi, F.; Koukoua, G.; N'Guessan, T.Y.; Costa, J.; Casanova, J., Combined analysis of Cymbopogon giganteus Chiov. leaf oil from Ivory Coast by GC/RI, GC/MS and 13C-NMR, C.R. Chim., 2006, 9, 1, 164-168, https://doi.org/10.1016/j.crci.2005.10.003 . [all data]

Umano, Hagi, et al., 2002
Umano, K.; Hagi, Y.; Shibamoto, T., Volatile chemicals identified in extracts from newly hybrid citrus, dekopon (Shiranuhi mandarin Suppl. J.), J. Agric. Food Chem., 2002, 50, 19, 5355-5359, https://doi.org/10.1021/jf0203951 . [all data]

Werkhoff, Güntert, et al., 1998
Werkhoff, P.; Güntert, M.; Krammer, G.; Sommer, H.; Kaulen, J., Vacuum headspace method in aroma research: flavor chemistry of yellow passion fruits, J. Agric. Food Chem., 1998, 46, 3, 1076-1093, https://doi.org/10.1021/jf970655s . [all data]