indium

Phase change data

Data compiled by: Thermodynamics Research Center, NIST Boulder Laboratories, Chris Muzny director

Quantity Value Units Method Reference Comment
Tfus430.15KN/AAnonymous, 1988Uncertainty assigned by TRC = 1. K; nominal value, from the catalog

In addition to the Thermodynamics Research Center (TRC) data available from this site, much more physical and chemical property data is available from the following TRC products:

References

Anonymous, 1988
Anonymous, X., , NBS Spec. Publ. (U. S.) 260, 1988. [all data]