Francium

Gas phase ion energetics data

Data compiled as indicated in comments:
LBLHLM - Sharon G. Lias, John E. Bartmess, Joel F. Liebman, John L. Holmes, Rhoda D. Levin, and W. Gary Mallard
RDSH - Henry M. Rosenstock, Keith Draxl, Bruce W. Steiner, and John T. Herron

Ionization energy determinations

IE (eV) Method Reference Comment
4.0712 ± 0.00004SAndreev, Letokhov, et al., 1987LBLHLM
3.98 ± 0.10SFinkelnburg and Humbach, 1955RDSH

References

Andreev, Letokhov, et al., 1987
Andreev, S.V.; Letokhov, V.S.; Mishin, V.I., Laser resonance photoionization spectroscopy of Rydberg levels in Fr, Phys. Rev. Lett., 1987, 59, 1274. [all data]

Finkelnburg and Humbach, 1955
Finkelnburg, W.; Humbach, W., Ionisierungsenergien von Atomen und Atomionen, Naturwiss., 1955, 42, 35. [all data]