holmium

Gas phase ion energetics data

Data evaluated as indicated in comments:
L - Sharon G. Lias

Data compiled as indicated in comments:
LL - Sharon G. Lias and Joel F. Liebman
LLK - Sharon G. Lias, Rhoda D. Levin, and Sherif A. Kafafi
RDSH - Henry M. Rosenstock, Keith Draxl, Bruce W. Steiner, and John T. Herron

Quantity Value Units Method Reference Comment
IE (evaluated)6.0216 ± 0.0006eVN/AN/AL

Ionization energy determinations

IE (eV) Method Reference Comment
6.0216EVALLide, 1992LL
6.0216 ± 0.0006LSWorden, Solarz, et al., 1978LLK
6.0216 ± 0.0006SMartin, Zalubas, et al., 1978LLK
6.017 ± 0.003PIPaisner, Solarz, et al., 1977LLK
6.0216 ± 0.0006LSPaisner, Solarz, et al., 1977LLK
6.1 ± 0.6EIKordis and Gingerich, 1977LLK
6.0 ± 0.1EIAckermann, Rauh, et al., 1976LLK
5.8 ± 0.2EICocke and Gingerich, 1971LLK
5.89 ± 0.03SIHertel, 1968RDSH
5.85 ± 0.10EIZmbov and Margrave, 1966RDSH
6.02 ± 0.02SReader and Sugar, 1966RDSH
6.08 ± 0.09SIDey and Karmohapatro, 1966RDSH
6.19 ± 0.02SIAlekseev and Kaminskii, 1965RDSH

References

Lide, 1992
Lide, D.R. (Editor), Ionization potentials of atoms and atomic ions in Handbook of Chem. and Phys., 1992, 10-211. [all data]

Worden, Solarz, et al., 1978
Worden, E.F.; Solarz, R.W.; Paisner, J.A.; Conway, J.G., First ionization potentials of lanthanides by laser spectroscopy, J. Opt. Soc. Am., 1978, 68, 52. [all data]

Martin, Zalubas, et al., 1978
Martin, W.C.; Zalubas, R.; Hagan, L., Atomic energy levels - the rare earth elements, Natl. Stand. Ref. Data Ser. (U.S. Natl. Bur. Stand.), 1978, 60. [all data]

Paisner, Solarz, et al., 1977
Paisner, J.A.; Solarz, R.W.; Worden, E.F.; Conway, J.G., IV. Highly excited states, ionization, and high intensity interactions Identification of Rydberg state in the atomic lanthanides and actinides, Springer Ser. Opt. Sci., 1977, 7, 160. [all data]

Kordis and Gingerich, 1977
Kordis, J.; Gingerich, K.A., Mass spectrometric observations of some polyatomic gaseous rare earth oxides their atomization energies, J. Chem. Phys., 1977, 66, 483. [all data]

Ackermann, Rauh, et al., 1976
Ackermann, R.J.; Rauh, E.G.; Thorn, R.J., The thermodynamics of ionization of gaseous oxides; the first ionization potentials of the lanthanide metals and monoxides, J. Chem. Phys., 1976, 65, 1027. [all data]

Cocke and Gingerich, 1971
Cocke, D.L.; Gingerich, K.A., Mass spectrometric determination of the dissociation energies of the molecules Ho2, HoAg, and HoAu, J. Phys. Chem., 1971, 75, 3264. [all data]

Hertel, 1968
Hertel, G.R., Surface ionization. III. The first ionization potentials of the lanthanides, J. Chem. Phys., 1968, 48, 2053. [all data]

Zmbov and Margrave, 1966
Zmbov, K.F.; Margrave, J.L., The first ionization potentials of samarium, europium, gadolinium, dysprosium, holmium, erbium, thulium, and ytterbium by the electron-impact method, J. Phys. Chem., 1966, 70, 3014. [all data]

Reader and Sugar, 1966
Reader, J.; Sugar, J., Ionization energies of the neutral rare earths, J. Opt. Soc. Am., 1966, 56, 1189. [all data]

Dey and Karmohapatro, 1966
Dey, S.D.; Karmohapatro, S.B., Determination of ionization potential of Gd and Ho by surface ionization method, Indian J. Phys., 1966, 40, 151. [all data]

Alekseev and Kaminskii, 1965
Alekseev, N.I.; Kaminskii, D.L., Ionization of some rare earth elements on the surfaces of tungsten, rhenium, and iridium, Zh. Tekhn. Fiz. 1964,34,1521 (Engl. Transl.: Soviet Phys. - Tech. Phys., 1965, 9, 1177). [all data]