barium

Gas phase thermochemistry data

Quantity Value Units Method Reference Comment
Δfgas179.08kJ/molReviewChase, 1998Data last reviewed in December, 1970
Quantity Value Units Method Reference Comment
gas,1 bar170.25J/mol*KReviewChase, 1998Data last reviewed in December, 1970

Gas Phase Heat Capacity (Shomate Equation)

Cp° = A + B*t + C*t2 + D*t3 + E/t2
H° − H°298.15= A*t + B*t2/2 + C*t3/3 + D*t4/4 − E/t + F − H
S° = A*ln(t) + B*t + C*t2/2 + D*t3/3 − E/(2*t2) + G
    Cp = heat capacity (J/mol*K)
    H° = standard enthalpy (kJ/mol)
    S° = standard entropy (J/mol*K)
    t = temperature (K) / 1000.

View plot Requires a JavaScript / HTML 5 canvas capable browser.

View table.

Temperature (K) 2119. - 4000.4000. - 6000.
A -623.2170769.8080
B 429.6010-284.4590
C -97.0137041.36660
D 7.474060-2.129091
E 488.2030-1693.040
F 1076.760-1665.750
G 18.96410-26.29590
H 179.0750179.0750
ReferenceChase, 1998Chase, 1998
Comment Data last reviewed in December, 1970 Data last reviewed in December, 1970

Condensed phase thermochemistry data

Quantity Value Units Method Reference Comment
Δfliquid4.99kJ/molReviewChase, 1998Data last reviewed in December, 1970
Quantity Value Units Method Reference Comment
liquid,1 bar66.33J/mol*KReviewChase, 1998Data last reviewed in December, 1970
Quantity Value Units Method Reference Comment
solid62.48J/mol*KReviewChase, 1998Data last reviewed in December, 1970

Liquid Phase Heat Capacity (Shomate Equation)

Cp° = A + B*t + C*t2 + D*t3 + E/t2
H° − H°298.15= A*t + B*t2/2 + C*t3/3 + D*t4/4 − E/t + F − H
S° = A*ln(t) + B*t + C*t2/2 + D*t3/3 − E/(2*t2) + G
    Cp = heat capacity (J/mol*K)
    H° = standard enthalpy (kJ/mol)
    S° = standard entropy (J/mol*K)
    t = temperature (K) / 1000.

View plot Requires a JavaScript / HTML 5 canvas capable browser.

View table.

Temperature (K) 1000. - 2118.599
A 55.01420
B -18.68350
C 2.757440
D 1.284171
E 3.022340
F -8.417321
G 134.9770
H 4.985180
ReferenceChase, 1998
Comment Data last reviewed in December, 1970

Solid Phase Heat Capacity (Shomate Equation)

Cp° = A + B*t + C*t2 + D*t3 + E/t2
H° − H°298.15= A*t + B*t2/2 + C*t3/3 + D*t4/4 − E/t + F − H
S° = A*ln(t) + B*t + C*t2/2 + D*t3/3 − E/(2*t2) + G
    Cp = heat capacity (J/mol*K)
    H° = standard enthalpy (kJ/mol)
    S° = standard entropy (J/mol*K)
    t = temperature (K) / 1000.

View plot Requires a JavaScript / HTML 5 canvas capable browser.

View table.

Temperature (K) 298. - 583.583. - 768.768. - 1000.
A 83.8018076.7154026.15520
B -406.1860-187.587028.60140
C 915.0660295.7110-23.68360
D -519.8050-113.93206.952170
E -0.191854-4.3444801.041351
F -14.63140-25.55610-5.801120
G 247.8400188.932089.99550
H 0.0000000.0000000.000000
ReferenceChase, 1998Chase, 1998Chase, 1998
Comment Data last reviewed in December, 1970 Data last reviewed in December, 1970 Data last reviewed in December, 1970

Phase change data

Antoine Equation Parameters

log10(P) = A − (B / (T + C))
    P = vapor pressure (bar)
    T = temperature (K)

View plot Requires a JavaScript / HTML 5 canvas capable browser.

Temperature (K) A B C Reference Comment
1257. - 1911.4.081887599.352-45.737Stull, 1947Coefficents calculated by NIST from author's data.

Gas phase ion energetics data

Data compiled as indicated in comments:
LL - Sharon G. Lias and Joel F. Liebman
LLK - Sharon G. Lias, Rhoda D. Levin, and Sherif A. Kafafi
RDSH - Henry M. Rosenstock, Keith Draxl, Bruce W. Steiner, and John T. Herron
B - John E. Bartmess

Electron affinity determinations

EA (eV) Reference Comment
0.144620 ± 0.000044Petrunin, Volstad, et al., 1995EA may be to an excited Ba state; B

Ionization energy determinations

IE (eV) Method Reference Comment
5.21170EVALLide, 1992LL
5.3 ± 0.3EILau, Brittain, et al., 1989LL
5.17 ± 0.08EIRauh and Ackermann, 1979LLK
5.0 ± 0.3EIKleinschmidt and Hildenbrand, 1978LLK
5.0PEHildenbrand, 1977LLK
5.1 ± 0.2EIHilpert, Naoumidis, et al., 1975LLK
5.22 ± 0.03PEBrehm and Hofler, 1975LLK
5.2 ± 0.1EIRauh and Ackermann, 1974LLK
~5.2EIOkudaira, 1970RDSH
5.21169 ± 0.000007EIMoore, 1970RDSH

References

Chase, 1998
Chase, M.W., Jr., NIST-JANAF Themochemical Tables, Fourth Edition, J. Phys. Chem. Ref. Data, Monograph 9, 1998, 1-1951. [all data]

Stull, 1947
Stull, Daniel R., Vapor Pressure of Pure Substances. Organic and Inorganic Compounds, Ind. Eng. Chem., 1947, 39, 4, 517-540, https://doi.org/10.1021/ie50448a022 . [all data]

Petrunin, Volstad, et al., 1995
Petrunin, V.V.; Volstad, J.D.; Balling, P.; Kristensen, K.; Andersen, T., Resonant Ionization Spectroscopy of Ba-: Metastable and Stable Ions, Phys. Rev. Lett., 1995, 75, 10, 1911, https://doi.org/10.1103/PhysRevLett.75.1911 . [all data]

Lide, 1992
Lide, D.R. (Editor), Ionization potentials of atoms and atomic ions in Handbook of Chem. and Phys., 1992, 10-211. [all data]

Lau, Brittain, et al., 1989
Lau, K.H.; Brittain, R.D.; Hildenbrand, D.L., High temperature thermodynamic studies of some gaseous thorium fluorides, J. Chem. Phys., 1989, 90, 1158. [all data]

Rauh and Ackermann, 1979
Rauh, E.G.; Ackermann, R.J., The first ionization potentials of the transition metals, J. Chem. Phys., 1979, 70, 1004. [all data]

Kleinschmidt and Hildenbrand, 1978
Kleinschmidt, P.D.; Hildenbrand, D.L., Dissociation energies of CaI, SrI, and BaI from high temperature mass spectrometry, J. Chem. Phys., 1978, 68, 2819. [all data]

Hildenbrand, 1977
Hildenbrand, D.L., Dissociation energies of CaBr, SrBr, BaBr, and BaCl from mass spectrometric studies of gaseous equilibria, J. Chem. Phys., 1977, 66, 3526. [all data]

Hilpert, Naoumidis, et al., 1975
Hilpert, K.; Naoumidis, A.; Wolff, G., Mass spectrometric study of the evaporation of BaAl2O4, High Temp. Sci., 1975, 7, 1. [all data]

Brehm and Hofler, 1975
Brehm, B.; Hofler, K., The 21.22-eV photoelectron spectrum of barium, Int. J. Mass Spectrom. Ion Phys., 1975, 17, 371. [all data]

Rauh and Ackermann, 1974
Rauh, E.G.; Ackermann, R.J., First ionization potentials of some refractory oxide vapors, J. Chem. Phys., 1974, 60, 1396. [all data]

Okudaira, 1970
Okudaira, S., Multiple ionization of Ca, Sr and Ba by electron impact, J. Phys. Soc. Jpn., 1970, 29, 409. [all data]

Moore, 1970
Moore, C.E., Ionization potentials and ionization limits derived from the analyses of optical spectra, Natl. Stand. Ref. Data Ser., (U.S. Natl. Bur. Stand.), 1970, 34, 1. [all data]