thorium

Gas phase thermochemistry data

Quantity Value Units Method Reference Comment
Δfgas602. ± 6.kJ/molReviewCox, Wagman, et al., 1984CODATA Review value
Quantity Value Units Method Reference Comment
gas,1 bar190.17 ± 0.05J/mol*KReviewCox, Wagman, et al., 1984CODATA Review value

Condensed phase thermochemistry data

Quantity Value Units Method Reference Comment
solid,1 bar51.8 ± 0.5J/mol*KReviewCox, Wagman, et al., 1984CODATA Review value

Gas phase ion energetics data

Data evaluated as indicated in comments:
L - Sharon G. Lias

Data compiled as indicated in comments:
LL - Sharon G. Lias and Joel F. Liebman
LLK - Sharon G. Lias, Rhoda D. Levin, and Sherif A. Kafafi
RDSH - Henry M. Rosenstock, Keith Draxl, Bruce W. Steiner, and John T. Herron

Quantity Value Units Method Reference Comment
IE (evaluated)6.308 ± 0.003eVN/AN/AL

Ionization energy determinations

IE (eV) Method Reference Comment
6.3067 ± 0.0002LSTrautmann, 1994LL
6.08EVALLide, 1992LL
6.310 ± 0.002LSJohnson, Fearey, et al., 1992LL
6.0 ± 0.3EILau and Hildenbrand, 1990LL
6.0 ± 0.3EILau, Brittain, et al., 1989LL
6.11 ± 0.02PELee and Potts, 1980LLK
6.9 ± 0.5EIGupta and Gingerich, 1980LLK
6.9 ± 0.5EIGingerich and Gupta, 1978LLK
6.08 ± 0.12EVALSugar, 1974LLK
6.0 ± 0.1EIRauh and Ackermann, 1974LLK
6.8EINeubert and Zmbov, 1974LLK
6.2 ± 0.2EIHildenbrand and Murad, 1974LLK
7.0 ± 0.5EIHildenbrand and Murad, 1974, 2LLK
6.08 ± 0.12SSugar, 1973LLK
5.9 ± 0.15EIAckermann and Rauh, 1973LLK
7.5 ± 0.3SISmith and Hertel, 1969RDSH
6.95 ± 0.06SIIonov and Mittsev, 1961RDSH

References

Cox, Wagman, et al., 1984
Cox, J.D.; Wagman, D.D.; Medvedev, V.A., CODATA Key Values for Thermodynamics, Hemisphere Publishing Corp., New York, 1984, 1. [all data]