ruthenium

Reaction thermochemistry data

Data compiled by: José A. Martinho Simões

Individual Reactions

Tri-ruthenium dodecacarbonyl (cr) = 12Carbon monoxide (g) + 3ruthenium (cr)

By formula: C12O12Ru3 (cr) = 12CO (g) + 3Ru (cr)

Quantity Value Units Method Reference Comment
Δr577. ± 13.kJ/molTD-HFCBaev, Connor, et al., 1981
Δr594. ± 17.kJ/molTD-HFCConnor, Skinner, et al., 1973Please also see Pedley and Rylance, 1977.

C12FeO12Ru2 (cr) = 12Carbon monoxide (g) + iron (cr) + 2ruthenium (cr)

By formula: C12FeO12Ru2 (cr) = 12CO (g) + Fe (cr) + 2Ru (cr)

Quantity Value Units Method Reference Comment
Δr565. ± 10.kJ/molTD-HFCBaev, Connor, et al., 1981

C12Fe2O12Ru (cr) = 12Carbon monoxide (g) + 2iron (cr) + ruthenium (cr)

By formula: C12Fe2O12Ru (cr) = 12CO (g) + 2Fe (cr) + Ru (cr)

Quantity Value Units Method Reference Comment
Δr494. ± 7.kJ/molTD-HFCBaev, Connor, et al., 1981

Gas phase ion energetics data

Data evaluated as indicated in comments:
HL - Edward P. Hunter and Sharon G. Lias
L - Sharon G. Lias

Data compiled as indicated in comments:
LL - Sharon G. Lias and Joel F. Liebman
LLK - Sharon G. Lias, Rhoda D. Levin, and Sherif A. Kafafi
RDSH - Henry M. Rosenstock, Keith Draxl, Bruce W. Steiner, and John T. Herron
B - John E. Bartmess

Quantity Value Units Method Reference Comment
IE (evaluated)7.36050 ± 0.00004eVN/AN/AL
Quantity Value Units Method Reference Comment
Proton affinity (review)185.kcal/molN/AHunter and Lias, 1998HL
Quantity Value Units Method Reference Comment
Gas basicity179.6kcal/molN/AHunter and Lias, 1998HL

Electron affinity determinations

EA (eV) Method Reference Comment
1.04638 ± 0.00026LPDNorquist, Beck, et al., 1999Given: 1.04638(25) eV; B

Ionization energy determinations

IE (eV) Method Reference Comment
7.36050EVALLide, 1992LL
7.36050 ± 0.00004LSCallender, Hackett, et al., 1988LL
7.16 ± 0.07EIRauh and Ackermann, 1979LLK
7.37SMoore, 1970RDSH

References

Baev, Connor, et al., 1981
Baev, A.K.; Connor, J.A.; El-Saied, N.I.; Skinner H.A., J. Organometal. Chem., 1981, 213, 151. [all data]

Connor, Skinner, et al., 1973
Connor, J.A.; Skinner, H.A.; Virmani, Y., High temperature microcalorimetric studies of the thermal decomposition and iodination of polynuclear carbonyls of Fe, Co, Ru, Rh, Re, Os and Ir, Faraday Symp. Chem. Soc., 1973, 8, 18, https://doi.org/10.1039/fs9730800018 . [all data]

Pedley and Rylance, 1977
Pedley, J.B.; Rylance, J., Computer Analysed Thermochemical Data: Organic and Organometallic Compounds, University of Sussex, Brigton, 1977. [all data]