rhenium

Reaction thermochemistry data

Data compiled by: José A. Martinho Simões

Individual Reactions

Dirhenium decacarbonyl (cr) = 10Carbon monoxide (g) + 2rhenium (cr)

By formula: C10O10Re2 (cr) = 10CO (g) + 2Re (cr)

Quantity Value Units Method Reference Comment
Δr129.0 ± 1.4kcal/molTD-HFCConnor, Skinner, et al., 1973
Δr132.0 ± 0.72kcal/molHAL-HFCConnor, Skinner, et al., 1973

C6H3O5Re (cr) = 5Carbon monoxide (g) + rhenium (cr) + Methane (g)

By formula: C6H3O5Re (cr) = 5CO (g) + Re (cr) + CH4 (g)

Quantity Value Units Method Reference Comment
Δr100.7 ± 2.0kcal/molHAL-HFCBrown, Connor, et al., 1974Please also see Pedley and Rylance, 1977.

References

Connor, Skinner, et al., 1973
Connor, J.A.; Skinner, H.A.; Virmani, Y., High temperature microcalorimetric studies of the thermal decomposition and iodination of polynuclear carbonyls of Fe, Co, Ru, Rh, Re, Os and Ir, Faraday Symp. Chem. Soc., 1973, 8, 18, https://doi.org/10.1039/fs9730800018 . [all data]

Brown, Connor, et al., 1974
Brown, D.L.S.; Connor, J.A.; Skinner, H.A., J. Organometal. Chem., 1974, 81, 403. [all data]

Pedley and Rylance, 1977
Pedley, J.B.; Rylance, J., Computer Analysed Thermochemical Data: Organic and Organometallic Compounds, University of Sussex, Brigton, 1977. [all data]