polonium

Gas phase ion energetics data

Data compiled as indicated in comments:
LL - Sharon G. Lias and Joel F. Liebman
RDSH - Henry M. Rosenstock, Keith Draxl, Bruce W. Steiner, and John T. Herron

Ionization energy determinations

IE (eV) Method Reference Comment
8.41671EVALLide, 1992LL
8.41671SMoore, 1970RDSH
8.2 ± 0.4SFinkelnburg and Humbach, 1955RDSH

References

Lide, 1992
Lide, D.R. (Editor), Ionization potentials of atoms and atomic ions in Handbook of Chem. and Phys., 1992, 10-211. [all data]

Moore, 1970
Moore, C.E., Ionization potentials and ionization limits derived from the analyses of optical spectra, Natl. Stand. Ref. Data Ser., (U.S. Natl. Bur. Stand.), 1970, 34, 1. [all data]

Finkelnburg and Humbach, 1955
Finkelnburg, W.; Humbach, W., Ionisierungsenergien von Atomen und Atomionen, Naturwiss., 1955, 42, 35. [all data]