2,3,5,6-Tetramethylbenzyl chloride

Normal alkane RI, non-polar column, temperature ramp

View large format table.

Column type Active phase I Reference Comment
CapillaryOV-1011478.Zenkevich and Makarov, 2007N2, 6. K/min; Column length: 25. m; Column diameter: 0.2 mm; Tstart: 60. C; Tend: 240. C

References

Zenkevich and Makarov, 2007
Zenkevich, I.G.; Makarov, A.A., Identification of Alkylarene Chloromethylation Products Using Gas-Chromatographic Retention Indices, Russian Journal of General Chemistry, 2007, 77, 4, 611-619, https://doi.org/10.1134/S1070363207040196 . [all data]