2,3',5',6-Tetrachloro-1,1'-biphenyl

Kovats' RI, non-polar column, isothermal

View large format table.

Column type Active phase Temperature (C) I Reference Comment
CapillaryApiezon L200.1996.Krupcík, Leclercq, et al., 1980N2; Column length: 50. m; Column diameter: 0.25 mm

References

Krupcík, Leclercq, et al., 1980
Krupcík, J.; Leclercq, P.A.; Garaj, J.; Símová, A., Analysis of alkylated mixtures of polychlorinated biphenyls by capillary gas chromatography-mass spectrometry, J. Chromatogr., 1980, 191, 207-220, https://doi.org/10.1016/S0021-9673(00)86381-5 . [all data]