Azulene,1,3-dibenzoyl-

Gas phase ion energetics data

Data compiled by: Sharon G. Lias, Rhoda D. Levin, and Sherif A. Kafafi

Ionization energy determinations

IE (eV) Method Reference Comment
7.7PEDougherty, Lewis, et al., 1980Vertical value

References

Dougherty, Lewis, et al., 1980
Dougherty, D.; Lewis, J.; Nauman, R.V.; McGlynn, S.P., Photoelectron spectroscopy of azulenes, J. Electron Spectrosc. Relat. Phenom., 1980, 19, 21. [all data]