Acetaldehyde, dimethylhydrazone

Gas phase ion energetics data

Data compiled as indicated in comments:
LLK - Sharon G. Lias, Rhoda D. Levin, and Sherif A. Kafafi

Ionization energy determinations

IE (eV) Method Reference Comment
7.54PEZverev, Vovna, et al., 1973LLK

Kovats' RI, non-polar column, isothermal

View large format table.

Column type Active phase Temperature (C) I Reference Comment
CapillaryMethyl Silicone60.676.Görgényi, Király, et al., 199750. m/0.32 mm/0.52 μm, N2
CapillaryHP-160.676.Király, Körtvélyesi, et al., 199650. m/0.32 mm/0.52 μm, N2
CapillaryHP-560.696.5Király, Körtvélyesi, et al., 199650. m/0.32 mm/0.52 μm, N2

Normal alkane RI, non-polar column, temperature ramp

View large format table.

Column type Active phase I Reference Comment
CapillaryOV-101675.Zenkevich, 200525. m/0.20 mm/0.10 μm, N2/He, 6. K/min; Tstart: 50. C; Tend: 250. C

References

Zverev, Vovna, et al., 1973
Zverev, V.V.; Vovna, V.I.; El'man, M.S.; Kitaev, Yu.P.; Vilesov, F.I., Photolectron spectra and spatial structure of acyclic azines, Dokl. Phys. Chem., 1973, 213, 945, In original 1319. [all data]