C11HF15S

Gas phase ion energetics data

Data compiled by: John E. Bartmess

De-protonation reactions

C11F15S- + Hydrogen cation = C11HF15S

By formula: C11F15S- + H+ = C11HF15S

Quantity Value Units Method Reference Comment
Δr1259. ± 8.4kJ/molIMRELeito, Raamat, et al., 2009gas phase

References

Leito, Raamat, et al., 2009
Leito, I.; Raamat, E.; Kutt, A.; Saame, J.; Kipper, K.; Koppel, I.A.; Koppel, I.; Zhang, M.; Mishima, M.; Yagupolskii, L.M.; Garlyauskayte, R.Y.; Filatov, A.A., Revision of the Gas-Phase Acidity Scale below 300 kcal mol(-1), J. Phys. Chem. A, 2009, 113, 29, 8421-8424, https://doi.org/10.1021/jp903780k . [all data]