Cyclopropenium,triphenyl-,tetrafluoroborate(1-)

Gas phase ion energetics data

Data compiled by: Sharon G. Lias, Rhoda D. Levin, and Sherif A. Kafafi

Ionization energy determinations

IE (eV) Method Reference
8.65 ± 0.05EIGyorosi, Hvistendahl, et al., 1975

Appearance energy determinations

Ion AE (eV) Other Products MethodReferenceComment
C21H15+9.3 ± 0.05BF3,FEIGyorosi, Hvistendahl, et al., 1975

References

Gyorosi, Hvistendahl, et al., 1975
Gyorosi, P.; Hvistendahl, G.; Undheim, K., Mass spectrometry of some triphenylcyclopropenium salts. Competition between dimerisation and adduct formation, Org. Mass Spectrom., 1975, 10, 744. [all data]