Naphthalene-1,2,4,5-tetracyanobenzene

Phase change data

Data compiled by: Eugene S. Domalski and Elizabeth D. Hearing

Enthalpy of phase transition

ΔHtrs (kJ/mol) Temperature (K) Initial Phase Final Phase Reference Comment
0.19275.crystaline, IIcrystaline, IBoerio-Goates, Westrum, et al., 1978

Entropy of phase transition

ΔStrs (J/mol*K) Temperature (K) Initial Phase Final Phase Reference Comment
2.9775.crystaline, IIcrystaline, IBoerio-Goates, Westrum, et al., 1978

References

Boerio-Goates, Westrum, et al., 1978
Boerio-Goates, J.; Westrum, E.F., Jr.; Fyfe, C.A., Thermodynamic studies of orientational disorder in p-p molecular compounds. I. Heat capacities of naphthalene-tetracyanobenzene, Mol. Cryst. Liq. Cryst., 1978, 48, 209-218. [all data]