Tin, dimethylbis(diethylphosphinodithioato-s,s')-

Gas phase ion energetics data

Data compiled by: Sharon G. Lias, Rhoda D. Levin, and Sherif A. Kafafi

Ionization energy determinations

IE (eV) Method Reference Comment
8.34PECauletti, Nicotra, et al., 1980Vertical value

References

Cauletti, Nicotra, et al., 1980
Cauletti, C.; Nicotra, G.; Piancastelli, M.N., The electronic structure of some alkyl-tin derivatives with sulphur-containing ligands studied by UV photoelectron spectroscopy, J. Organomet. Chem., 1980, 190, 147. [all data]