p-Coumaric acid

Phase change data

Data compiled by: Thermodynamics Research Center, NIST Boulder Laboratories, Chris Muzny director

Quantity Value Units Method Reference Comment
Tfus489.KN/ABaird and Winstein, 1963Uncertainty assigned by TRC = 5. K
Tfus486.9KN/ASovish, 1959Uncertainty assigned by TRC = 3. K
Tfus475.KN/ASchmid and Karrer, 1945Uncertainty assigned by TRC = 5. K

In addition to the Thermodynamics Research Center (TRC) data available from this site, much more physical and chemical property data is available from the following TRC products:

Normal alkane RI, non-polar column, isothermal

View large format table.

Column type Active phase Temperature (C) I Reference Comment
PackedApieson L140.1635.Hedin, Minyard, et al., 1967Nitrogen, Chromosorb W HMDS (60-80 mesh); Column length: 1.8 m

Normal alkane RI, non-polar column, custom temperature program

View large format table.

Column type Active phase I Reference Comment
CapillaryDB-11631.Marlatt, Ho, et al., 199230. m/0.25 mm/0.25 μm; Program: not specified

References

Baird and Winstein, 1963
Baird, R.; Winstein, S., Neighboring Carbon and Hydrogen. LI. Dienones from Ar1-3 Participation. Isolation and Behavior of Spiro(2,5)octa-1,4-diene-3-one, J. Am. Chem. Soc., 1963, 85, 567. [all data]

Sovish, 1959
Sovish, R.C., Preparation and Polymerization of p-Vinylphenol, J. Org. Chem., 1959, 24, 1345. [all data]

Schmid and Karrer, 1945
Schmid, H.; Karrer, P., Water Soluble Extractives of Papaver Somniferum L. I., Helv. Chim. Acta, 1945, 28, 742. [all data]

Hedin, Minyard, et al., 1967
Hedin, P.A.; Minyard, J.P.; Thompson, A.C., Chromatographic and spectral analysis of phenolic acids and related compounds, J. Chromatogr., 1967, 30, 43-53, https://doi.org/10.1016/S0021-9673(00)84111-4 . [all data]

Marlatt, Ho, et al., 1992
Marlatt, C.; Ho, C.-T.; Chien, M., Studies of aroma constituents bound as glycosides in tomato, J. Agric. Food Chem., 1992, 40, 2, 249-252, https://doi.org/10.1021/jf00014a016 . [all data]