Trimipramine

Kovats' RI, non-polar column, temperature ramp

Data compiled by: NIST Mass Spectrometry Data Center, William E. Wallace, director

Column type Capillary
Active phase SE-30
Column length (m) 25.
Carrier gas
Substrate
Column diameter (mm) 0.49
Phase thickness (μm) 1.14
Tstart (C) 100.
Tend (C) 275.
Heat rate (K/min) 8.
Initial hold (min) 2.
Final hold (min) 15.
I 2228.
ReferenceSchepers, Wijsbeek, et al., 1982
Comment MSDC-RI

Kovats' RI, non-polar column, custom temperature program

Data compiled by: NIST Mass Spectrometry Data Center, William E. Wallace, director

Column type Packed
Active phase OV-101
Column length (m) 2.
Carrier gas N2
Substrate Chromosorb W
Column diameter (mm)
Phase thickness (μm)
Program not specified
I 2200.
ReferenceMcLinden and Stenhouse, 1979
Comment MSDC-RI

References

Schepers, Wijsbeek, et al., 1982
Schepers, P.; Wijsbeek, J.; Franke, J.P.; de Zeeuw, R.A., Applicability of capillary gas chromatography to substance identification in toxicology by means of retention indices, J. Forensic Sci., 1982, 27, 1, 49-60. [all data]