Trimethoprim

Phase change data

Data compiled by: William E. Acree, Jr., James S. Chickos

Enthalpy of fusion

ΔfusH (kcal/mol) Temperature (K) Method Reference
11.9472.9DSCWassvik, Holmén, et al., 2006
12.82474.N/AIssa, El-Ansary, et al., 1998

Kovats' RI, non-polar column, isothermal

View large format table.

Column type Active phase Temperature (C) I Reference Comment
CapillarySPB-1250.2574.Lora-Tamayo, Rams, et al., 1986He; Column length: 25. m; Column diameter: 0.20 mm

Van Den Dool and Kratz RI, non-polar column, temperature ramp

View large format table.

Column type Active phase I Reference Comment
CapillarySPB-12564.Christ, Noomano, et al., 198830. m/0.75 mm/1.0 μm, He, 10. K/min, 280. C @ 12. min; Tstart: 160. C

References

Wassvik, Holmén, et al., 2006
Wassvik, Carola M.; Holmén, Anders G.; Bergström, Christel A.S.; Zamora, Ismael; Artursson, Per, Contribution of solid-state properties to the aqueous solubility of drugs, European Journal of Pharmaceutical Sciences, 2006, 29, 3-4, 294-305, https://doi.org/10.1016/j.ejps.2006.05.013 . [all data]

Issa, El-Ansary, et al., 1998
Issa, Y.M.; El-Ansary, A.L.; Selim, W., Enthalpimetric Determination of Sulfa Drugs in Pure Form and Pharmaceutical Formulations, Analytical Letters, 1998, 31, 1, 131-146, https://doi.org/10.1080/00032719808001838 . [all data]

Lora-Tamayo, Rams, et al., 1986
Lora-Tamayo, C.; Rams, M.A.; Chacon, J.M.R., Gas Chromatographic Data for 187 Nitrogen- or Phosphorus-Containing Drugs and Metabolites of Toxicological Interest Analysed on Methyl Silicone Capillary Columns, J. Chromatogr., 1986, 374, 73-85, https://doi.org/10.1016/S0378-4347(00)83254-5 . [all data]

Christ, Noomano, et al., 1988
Christ, D.W.; Noomano, P.; Rosas, M.; Rhone, D., Retention indices by wide-bore capillary gas chromatography with nitrogen-phosphorus detection, J. Anal. Toxicol., 1988, 12, 2, 84-88, https://doi.org/10.1093/jat/12.2.84 . [all data]