11-Methylnonacosane

Kovats' RI, non-polar column, isothermal

View large format table.

Column type Active phase Temperature (C) I Reference Comment
CapillaryDB-1250.2938.Szafranek, Malinski, et al., 2001Ar; Column length: 30. m; Column diameter: 0.28 mm

Van Den Dool and Kratz RI, non-polar column, temperature ramp

View large format table.

Column type Active phase I Reference Comment
CapillaryDB-5MS2932.Steiner, Steidle, et al., 200530. m/0.32 mm/0.25 μm, He, 2. K/min; Tstart: 150. C; Tend: 300. C
CapillaryUltra-12932.Nelson, Adams, et al., 2003150. C @ 4. min, 4. K/min, 320. C @ 30. min; Column length: 12. m; Column diameter: 0.2 mm
CapillaryDB-5MS2929.Steinmetz, Schmolz, et al., 200330. m/0.32 mm/0.25 μm, He, 3. K/min; Tstart: 150. C; Tend: 280. C
CapillaryHT-52935.Goh S.H., Ooi K.E., et al., 199325. m/0.53 mm/0.22 μm, N2, 15. K/min, 320. C @ 20. min; Tstart: 150. C
CapillaryHT-52932.Goh S.H., Ooi K.E., et al., 199325. m/0.53 mm/0.22 μm, N2, 15. K/min, 320. C @ 20. min; Tstart: 150. C

Van Den Dool and Kratz RI, non-polar column, custom temperature program

View large format table.

Column type Active phase I Reference Comment
CapillaryDB-12935.Bernier, Carlson, et al., 199830. m/0.32 mm/0.25 μm; Program: 60C (2min) => 10C/min => 220C => 3C/min => 310C
CapillaryDB-12934.Sutton and Carlson, 1993He; Column length: 30. m; Column diameter: 0.25 mm; Program: 60C => 20C/min => 230C => 5C/min => 330C

Normal alkane RI, non-polar column, temperature ramp

View large format table.

Column type Active phase I Reference Comment
CapillaryDB-12933.Strohm, Herner, et al., 200830. m/0.25 mm/0.25 μm, Helium, 6. K/min, 300. C @ 20. min; Tstart: 100. C
CapillaryOV-12935.5Krkosova, Kubinec, et al., 2007100. m/0.32 mm/0.25 μm, Helium, 5. K/min, 310. C @ 5. min; Tstart: 30. C
CapillaryDB-52931.Juárez, Blomquist, et al., 2001He, 3. K/min; Column length: 30. m; Column diameter: 0.32 mm; Tstart: 200. C; Tend: 280. C
CapillaryBP-12933.Lockey and Oraha, 199012. m/0.22 mm/0.25 μm, Helium, 2. K/min; Tstart: 100. C; Tend: 300. C
CapillaryBP-12933.Lockey and Oraha, 199012. m/0.22 mm/0.25 μm, Helium, 2. K/min; Tstart: 100. C; Tend: 300. C
CapillaryDexsil 3002930.Lockey, 19785. K/min; Column length: 15. m; Tstart: 50. C; Tend: 370. C
CapillaryDexsil 3002930.Lockey, 19785. K/min; Column length: 15. m; Tstart: 50. C; Tend: 370. C
CapillaryDexsil 3002929.Lockey, 1978, 22. K/min; Column length: 15. m; Tstart: 240. C; Tend: 330. C
CapillaryDexsil 3002929.Lockey, 1978, 22. K/min; Column length: 15. m; Tstart: 240. C; Tend: 330. C

Normal alkane RI, non-polar column, custom temperature program

View large format table.

Column type Active phase I Reference Comment
Capillary 2934.Steiger, Peschke, et al., 2007Program: not specified
CapillaryMethyl Silicone2930.Sullivan, 2002Program: not specified
CapillaryDB-12935.Carlson, Geden, et al., 199930. m/0.32 mm/0.25 μm, He; Program: 60C (2min) => 10C/min => 220C => 3C/min => 310C (12 - 42 min)
CapillaryCP Sil 5 CB2932.Kenig, Sinninghe Damsté, et al., 199525. m/0.32 mm/0.2 μm, He; Program: 50C => 20C/min => 130C => 4C/min => 300C (20min)
CapillaryDexsil 3002942.Lockey, 1981Column length: 15. m; Program: 50 0C 5 0C/min -> 200 0C 2 0C/min -> 340 0C

References

Szafranek, Malinski, et al., 2001
Szafranek, B.; Malinski, E.; Nawrot, J.; Sosnowska, D.; Ruszkowska, M.; Pihlaja, K.; Trumpakaj, Z.; Szafranek, J., In Vitro effects of cuticular lipids of the aphids Sitobion avenae, Hyalopterus pruni and Brevicoryne brassicae on growth and sporulation of the Paecilomyces fumosoroseus and Beauveria bassiana, Arkivoc, 2001, 2001, 3, 81-94, https://doi.org/10.3998/ark.5550190.0002.311 . [all data]

Steiner, Steidle, et al., 2005
Steiner, S.; Steidle, J.L.M.; Ruther, J., Female sex pheromone in immature insect males - a case of pre-emergence chemical mimicry?, Behavioral Ecology and Sociobiology, 2005, 58, 2, 111-120, https://doi.org/10.1007/s00265-005-0930-x . [all data]

Nelson, Adams, et al., 2003
Nelson, D.R.; Adams, T.S.; Fatland, C.L., Hydrocarbons in the surface wax of eggs and adults of the Colorado potato beetle, Leptinotarsa decemlineata, Comp. Biochem. Physiol. B: Comp. Biochem., 2003, 134, 3, 447-466, https://doi.org/10.1016/S1096-4959(02)00262-2 . [all data]

Steinmetz, Schmolz, et al., 2003
Steinmetz, I.; Schmolz, E.; Ruther, J., Cuticular lipids as trail pheromone in a social wasp, Proc. R. Soc. London B:, 2003, 270, 1513, 385-391, https://doi.org/10.1098/rspb.2002.2256 . [all data]

Goh S.H., Ooi K.E., et al., 1993
Goh S.H.; Ooi K.E.; Chuah C.H.; Yong H.S.; Khoo S.G.; Ong S.H., Cuticular hydrocarbons from two species of Malaysian Bactrocera fruit flies, Biochem. Syst. Ecol., 1993, 21, 2, 215-226, https://doi.org/10.1016/0305-1978(93)90039-T . [all data]

Bernier, Carlson, et al., 1998
Bernier, U.R.; Carlson, D.A.; Geden, C.J., Gas chromatography/mass spectrometry analysis of the cuticular hydrocarbons from parasitic wasps of the genus Muscidifurax, J. Am. Soc. Mass Spectrom., 1998, 9, 4, 320-332, https://doi.org/10.1016/S1044-0305(97)00288-2 . [all data]

Sutton and Carlson, 1993
Sutton, B.D.; Carlson, D.A., Interspecific variation in tephritid fruit fly larvae surface hydrocarbons, Arch. Insect Biochem. Physiol., 1993, 23, 2, 53-65, https://doi.org/10.1002/arch.940230202 . [all data]

Strohm, Herner, et al., 2008
Strohm, E.; Herner, G.; Kaltenpoth, M.; Boland, W.; Schreier, P.; Geiselhardt, S.; Peschke, K.; Schmitt, T., The chemistry of the postpharyngeal gland of female European beewolves, J. Chem. Ecol., 2008, 34, 5, 575-583, https://doi.org/10.1007/s10886-008-9447-x . [all data]

Krkosova, Kubinec, et al., 2007
Krkosova, Z.; Kubinec, R.; Addova, G.; Jurdakova, H.; Blasko, J.; Ostrovsky, I.; Sojak, L., Gas chromatographic - mass spectrometric characterization of monomethylalkanes from fuel diesel, Petroleum Coal, 2007, 49, 3, 51-62. [all data]

Juárez, Blomquist, et al., 2001
Juárez, P.; Blomquist, G.J.; Schofield, C.J., Hydrocarbons of Rhodnius prolixus, a Chagas disease vector, Comp. Biochem. Physiol. B: Comp. Biochem., 2001, 129, 4, 733-746, https://doi.org/10.1016/S1096-4959(01)00380-3 . [all data]

Lockey and Oraha, 1990
Lockey, K.H.; Oraha, V.S., Cuticular lipids of adult Locusta Migratoria Migratoriodes (R and F), Schstocerca Gregaria (Forskal) (Acrididae) and other orthopteran species - II. Hydrocarbons, Comp. Biochem. Physiol., 1990, 95B, 4, 721-744. [all data]

Lockey, 1978
Lockey, K.H., The adult cuticular hydrocarbons of Tenebrio Molitor L. and Tenebrio Obscurus F. (Coleoptera: Tenebrionidae), Insect Biochem., 1978, 8, 4, 237-250, https://doi.org/10.1016/0020-1790(78)90032-X . [all data]

Lockey, 1978, 2
Lockey, K.H., Hydrocarbons of adult Tribolum castaneum Hbst. and Tribolium confusum duv. (Coleoptera: Tenebrionidae), Comparative Biochem. Physiol., 1978, 61B, 401-407. [all data]

Steiger, Peschke, et al., 2007
Steiger, S.; Peschke, K.; Francke, W.; Muller, J.K., The smell of parents: breeding status influences cuticular hydrocarbon pattern in the burying beetle Nicrophorus vespilloides, Proc. Roy. Soc. B, 2007, 274, 1622, 2211-2220, https://doi.org/10.1098/rspb.2007.0656 . [all data]

Sullivan, 2002
Sullivan, B.T., Evidence for a sex pheromone in bark beetle parasitoid Roptrpcerus xylophagorum, J. Chem. Ecology, 2002, 28, 5, 1045-1063, https://doi.org/10.1023/A:1015270003717 . [all data]

Carlson, Geden, et al., 1999
Carlson, D.A.; Geden, C.J.; Bernier, U.R., Identification of pupal exiviae of Nasania vitripennis and Muscidifurax raptorellus parasitoids using cuticular hydrocarbons, Biol. Control, 1999, 15, 2, 97-106, https://doi.org/10.1006/bcon.1999.0708 . [all data]

Kenig, Sinninghe Damsté, et al., 1995
Kenig, F.; Sinninghe Damsté, J.S.; Kock-van Dalen, A.C.; Rijpstra, W.I.C.; Huc, A.Y.; de Leeuw, J.W., Occurrence and origin of mono-, di-, and trimethylalkanes in modern and holocene cyanobacterial mats from Abu Dhabi, United Arab Emirates, Geochim. Cosmochim. Acta, 1995, 59, 14, 2999-3015, https://doi.org/10.1016/0016-7037(95)00190-5 . [all data]

Lockey, 1981
Lockey, K.H., Cuticular hydrocarbons of adult Cylindrinotus laevioctostriatus (Goeze) and Phylan gibbus (Fabricius) (Coleoptera: Tenebrionidae), Insect. Biochem., 1981, 11, 5, 549-561, https://doi.org/10.1016/0020-1790(81)90023-8 . [all data]