2H-Pyran-2-one, tetrahydro-6-octyl-

Van Den Dool and Kratz RI, polar column, temperature ramp

Data compiled by: NIST Mass Spectrometry Data Center, William E. Wallace, director

Column type Capillary
Active phase DB-Wax
Column length (m) 60.
Carrier gas He
Substrate
Column diameter (mm) 0.25
Phase thickness (μm) 0.25
Tstart (C) 50.
Tend (C) 230.
Heat rate (K/min) 2.
Initial hold (min)
Final hold (min) 60.
I 2565.
ReferenceShimoda, Yoshimura, et al., 2001
Comment MSDC-RI

References

Shimoda, Yoshimura, et al., 2001
Shimoda, M.; Yoshimura, Y.; Yoshimura, T.; Noda, K.; Osajima, Y., Volatile flavor compounds of sweetened condensed milk, J. Food Sci., 2001, 66, 6, 804-807, https://doi.org/10.1111/j.1365-2621.2001.tb15176.x . [all data]