2-Decenoic acid, methyl ester, (E)-

Normal alkane RI, non-polar column, temperature ramp

View large format table.

Column type Active phase I Reference Comment
CapillarySPB-11299.Wong, Lim, et al., 200650. m/0.2 mm/0.33 μm, He, 50. C @ 1. min, 4. K/min, 220. C @ 10. min

Normal alkane RI, polar column, temperature ramp

View large format table.

Column type Active phase I Reference Comment
CapillarySupelcowax-101619.Wong, Lim, et al., 200630. m/0.25 mm/0.25 μm, He, 50. C @ 1. min, 4. K/min, 220. C @ 10. min

References

Wong, Lim, et al., 2006
Wong, K.C.; Lim, T.B.; Ali, D.M.H., Essential oil of Homalomena sagittifolia Jungh., Flavour Fragr. J., 2006, 21, 5, 786-788, https://doi.org/10.1002/ffj.1714 . [all data]