4-Decenoic acid, ethyl ester, (Z)-

Kovats' RI, non-polar column, temperature ramp

Data compiled by: NIST Mass Spectrometry Data Center, William E. Wallace, director

Column type CapillaryCapillaryCapillaryCapillaryCapillary
Active phase DB-1DB-1DB-1DB-1DB-1
Column length (m) 60.60.60.60.60.
Carrier gas HeHeHeHeHe
Substrate
Column diameter (mm) 0.320.320.320.320.32
Phase thickness (μm) 0.250.250.250.250.25
Tstart (C) 30.30.30.30.30.
Tend (C) 210.210.210.210.210.
Heat rate (K/min) 2.2.2.2.2.
Initial hold (min) 4.4.4.4.4.
Final hold (min)
I 1363.1361.1361.1363.1361.
ReferenceTakeoka, Buttery, et al., 1992Takeoka, Buttery, et al., 1992Takeoka, Buttery, et al., 1992Takeoka, Buttery, et al., 1992Takeoka, Flath, et al., 1990
Comment MSDC-RI MSDC-RI MSDC-RI MSDC-RI MSDC-RI
Column type Capillary
Active phase DB-1
Column length (m) 60.
Carrier gas He
Substrate
Column diameter (mm) 0.32
Phase thickness (μm) 0.25
Tstart (C) 30.
Tend (C) 210.
Heat rate (K/min) 2.
Initial hold (min) 4.
Final hold (min)
I 1363.
ReferenceTakeoka, Flath, et al., 1990
Comment MSDC-RI

References

Takeoka, Buttery, et al., 1992
Takeoka, G.R.; Buttery, R.G.; Flath, R.A., Volatile constituents of Asian pear (Pyrus serotina), J. Agric. Food Chem., 1992, 40, 10, 1925-1929, https://doi.org/10.1021/jf00022a040 . [all data]

Takeoka, Flath, et al., 1990
Takeoka, G.R.; Flath, R.A.; Mon, T.R.; Teranishi, R.; Guentert, M., Volatile Constituents of Apricot (Prunus armeniaca), J. Agric. Food Chem., 1990, 38, 2, 471-477, https://doi.org/10.1021/jf00092a031 . [all data]