4-Decenoic acid, methyl ester, Z-

Normal alkane RI, non-polar column, custom temperature program

Data compiled by: NIST Mass Spectrometry Data Center, William E. Wallace, director

Column type CapillaryCapillaryCapillary
Active phase HP-1DB-1DB-1
Column length (m) 50.30.30.
Carrier gas N2H2H2
Substrate
Column diameter (mm) 0.320.250.25
Phase thickness (μm) 0.520.250.25
Program 40C => 2C/min => 130C => 4C/min => 250C30C (2min) => 2C/min => 150C => 4C/min => 250C30C (2min) => 2C/min => 150C => 4C/min => 250C
I 1289.1288.1289.
ReferenceTeai, Claude-Lafontaine, et al., 2001Takeoka, Flath, et al., 1988Takeoka, Flath, et al., 1988
Comment MSDC-RI MSDC-RI MSDC-RI

Normal alkane RI, polar column, temperature ramp

Data compiled by: NIST Mass Spectrometry Data Center, William E. Wallace, director

Column type CapillaryCapillaryCapillaryCapillary
Active phase DB-WaxDB-WaxDB-WaxDB-Wax
Column length (m) 60.60.60.60.
Carrier gas HeHeH2H2
Substrate
Column diameter (mm) 0.320.320.250.25
Phase thickness (μm) 0.250.250.250.25
Tstart (C) 30.30.30.30.
Tend (C) 180.180.180.180.
Heat rate (K/min) 2.2.2.2.
Initial hold (min) 4.4.2.2.
Final hold (min)
I 1612.1623.1621.1622.
ReferenceTakeoka and Butter, 1989Takeoka and Butter, 1989Takeoka, Flath, et al., 1988Takeoka, Flath, et al., 1988
Comment MSDC-RI MSDC-RI MSDC-RI MSDC-RI

Normal alkane RI, non-polar column, temperature ramp

Data compiled by: NIST Mass Spectrometry Data Center, William E. Wallace, director

Column type CapillaryCapillary
Active phase DB-1DB-1
Column length (m) 60.60.
Carrier gas HeHe
Substrate
Column diameter (mm) 0.320.32
Phase thickness (μm)
Tstart (C) 30.30.
Tend (C) 210.210.
Heat rate (K/min) 2.2.
Initial hold (min) 4.4.
Final hold (min)
I 1289.1291.
ReferenceTakeoka and Butter, 1989Takeoka and Butter, 1989
Comment MSDC-RI MSDC-RI

Normal alkane RI, polar column, custom temperature program

Data compiled by: NIST Mass Spectrometry Data Center, William E. Wallace, director

Column type Capillary
Active phase Carbowax 20M
Column length (m) 50.
Carrier gas N2
Substrate
Column diameter (mm) 0.2
Phase thickness (μm) 0.2
Program 60C => 2C/min => 150C => 4C/min => 220C
I 1629.
ReferenceTeai, Claude-Lafontaine, et al., 2001
Comment MSDC-RI

References

Teai, Claude-Lafontaine, et al., 2001
Teai, T.; Claude-Lafontaine, A.; Schippa, C.; Cozzolino, F., Volatile compounds in fresh pulp of pineapple (Ananas comosus [L.] Merr.) from French Polynesia, J. Essent. Oil Res., 2001, 13, 5, 314-318, https://doi.org/10.1080/10412905.2001.9712222 . [all data]

Takeoka, Flath, et al., 1988
Takeoka, G.R.; Flath, R.A.; Güntert, M.; Jennings, W., Nectarine volatiles: vacuum steam distillation versus headspace sampling, J. Agric. Food Chem., 1988, 36, 3, 553-560, https://doi.org/10.1021/jf00081a037 . [all data]