Ethyl (E)-2-octenoate

Van Den Dool and Kratz RI, polar column, temperature ramp

Data compiled by: NIST Mass Spectrometry Data Center, William E. Wallace, director

Column type Capillary
Active phase AT-Wax
Column length (m) 60.
Carrier gas He
Substrate
Column diameter (mm) 0.32
Phase thickness (μm) 0.25
Tstart (C) 65.
Tend (C) 250.
Heat rate (K/min) 2.
Initial hold (min) 10.
Final hold (min) 60.
I 1540.
ReferencePino, Almora, et al., 2003
Comment MSDC-RI

Van Den Dool and Kratz RI, non-polar column, custom temperature program

Data compiled by: NIST Mass Spectrometry Data Center, William E. Wallace, director

Column type Capillary
Active phase VF-5MS
Column length (m) 30.
Carrier gas He
Substrate
Column diameter (mm) 0.25
Phase thickness (μm) 0.25
Program Multi-step temperature program; T(initial)=60C; T(final)=270C
I 1252.9
ReferenceTret'yakov, 2007
Comment MSDC-RI

References

Pino, Almora, et al., 2003
Pino, J.; Almora, K.; Marbot, R., Volatile components of papaya (Carica papaya L., maradol variety) fruit, Flavour Fragr. J., 2003, 18, 6, 492-496, https://doi.org/10.1002/ffj.1248 . [all data]