13,14-Dioxatricyclo[8.2.1.14,7]tetradeca-4,6,10,12-tetraene

Gas phase ion energetics data

Data compiled as indicated in comments:
LLK - Sharon G. Lias, Rhoda D. Levin, and Sherif A. Kafafi

Ionization energy determinations

IE (eV) Method Reference Comment
7.60PEKovac, Allan, et al., 1980LLK

References

Kovac, Allan, et al., 1980
Kovac, B.; Allan, M.; Heilbronner, E.; Maier, J.P.; Gleiter, R.; Haenel, M.W.; Keehn, P.M.; Reiss, J.A., He(Iα) photoelectron spectra of [2.2]cyclophanes, J. Electron Spectrosc. Relat. Phenom., 1980, 19, 167. [all data]