5,14-Ethenobenzocyclododecen-8,11-imine,6,7,12,13-tetrahydro-

Gas phase ion energetics data

Data compiled by: Sharon G. Lias, Rhoda D. Levin, and Sherif A. Kafafi

Ionization energy determinations

IE (eV) Method Reference Comment
7.35PEKovac, Allan, et al., 1980Vertical value

References

Kovac, Allan, et al., 1980
Kovac, B.; Allan, M.; Heilbronner, E.; Maier, J.P.; Gleiter, R.; Haenel, M.W.; Keehn, P.M.; Reiss, J.A., He(Iα) photoelectron spectra of [2.2]cyclophanes, J. Electron Spectrosc. Relat. Phenom., 1980, 19, 167. [all data]