3H-Indazol-3-one, 1,2-dihydro-

Phase change data

Data compiled by: William E. Acree, Jr., James S. Chickos

Quantity Value Units Method Reference Comment
Δsub127.6 ± 1.5kJ/molCMorais, Miranda, et al., 2006

References

Morais, Miranda, et al., 2006
Morais, V.M.F.; Miranda, M.S.; Matos, M.A.R.; Liebman, J.F., Experimental and computational thermochemistry of three nitrogen-containing heterocycles: 2-benzimidazolinone, 2-benzoxazolinone and 3-indazolinone, Molecular Physics, 2006, 104, 3, 325-334, https://doi.org/10.1080/00268970500290300 . [all data]