2-Chloroadamantane

Kovats' RI, non-polar column, isothermal

View large format table.

Column type Active phase Temperature (C) I Reference Comment
PackedSE-30150.1350.L'vova, Kurbatova, et al., 2001N2, N-AW Chromaton; Column length: 1. m
PackedSE-30150.1345.Yashkin, Kurbatova, et al., 2001CHromaton N-AW; Column length: 1. m
CapillarySE-30145.1342.Burkhard, Vais, et al., 1969N2; Column length: 50. m; Column diameter: 0.27 mm
CapillarySE-30160.1361.Burkhard, Vais, et al., 1969N2; Column length: 50. m; Column diameter: 0.27 mm
CapillarySE-30175.1376.Burkhard, Vais, et al., 1969N2; Column length: 50. m; Column diameter: 0.27 mm

Kovats' RI, polar column, isothermal

View large format table.

Column type Active phase Temperature (C) I Reference Comment
PackedCarbowax 20M150.1745.L'vova, Kurbatova, et al., 2001N2, N-AW Chromaton; Column length: 1. m
PackedCarbowax 20M150.1741.Yashkin, Kurbatova, et al., 2001Column length: 1. m
CapillaryCarbowax 20M145.1738.Burkhard, Vais, et al., 1969N2; Column length: 50. m; Column diameter: 0.27 mm
CapillaryCarbowax 20M160.1765.Burkhard, Vais, et al., 1969N2; Column length: 50. m; Column diameter: 0.27 mm
CapillaryCarbowax 20M175.1791.Burkhard, Vais, et al., 1969N2; Column length: 50. m; Column diameter: 0.27 mm

Van Den Dool and Kratz RI, non-polar column, temperature ramp

View large format table.

Column type Active phase I Reference Comment
CapillaryVF-5MS1404.N/A30. m/0.25 mm/0.25 μm, He; Tstart: 60. C; Tend: 270. C

Normal alkane RI, non-polar column, custom temperature program

View large format table.

Column type Active phase I Reference Comment
CapillaryPolydimethyl siloxane1342.Bayat and Abad, 2011Program: not specified

References

L'vova, Kurbatova, et al., 2001
L'vova, N.Yu.; Kurbatova, S.V.; Yashkin, S.N.; Kolosova, E.A., Gas chromatography of halogenated adamantanes, Russ. J. Phys. Chem. (Engl. Transl.), 2001, 75, 12, 2053-2056. [all data]

Yashkin, Kurbatova, et al., 2001
Yashkin, S.N.; Kurbatova, S.V.; Buryak, A.K., Gas chromatography of halogenated adamantanes, Russ. Chem. Bull. (Engl. Transl.), 2001, 50, 5, 828-832, https://doi.org/10.1023/A:1011350908009 . [all data]

Burkhard, Vais, et al., 1969
Burkhard, J.; Vais, J.; Vodicka, L.; Landa, S., Adamantane and its derivatives. XVI. The gas chromatographic characterization of adamantane derivatives, J. Chromatogr., 1969, 42, 207-218, https://doi.org/10.1016/S0021-9673(01)80617-8 . [all data]

Bayat and Abad, 2011
Bayat, Z.; Abad, M.F.Y., Quantitative structure-property relationship (QSPR) study of Kovats retention indices of some of adamantane derivatives by the genetic algorithm amd nultiply linear regression (GA-MLR) method, Petroleum Coal, 2011, 53, 2, 132-140. [all data]